﻿"Numéro de certificat","Catégorie de produit",Type,Marque,Distributeur,Variant,Détenteur,E-mail,Certificateur,Version,"Date de début","Date de fin",Référence,"Référence 2",Remarque,Statut
B-893-0014,"détecteur PIR + MWPIR + MW",DT8016MF4,HONEYWELL,"Honeywell Security Group Nederland","DT8016F4, DT8012F4","Honeywell Security",,ANPI,0,20/10/2014,19/10/2020,"T 014",,,
B-893-0015,"Détecteur PIR",IS3016,HONEYWELL,"Honeywell Security Group Nederland",IS3012,"Honeywell Security",,ANPI,0,20/10/2014,19/10/2020,"T 014",,,
B-893-0016,"Détecteur PIR",IS312,HONEYWELL,"ADI - Gardiner",IS312B,"Sécurité Communications SAS",,ANPI,0,26/02/2016,06/04/2021,"T 031",,,
B-893-0016,"Détecteur PIR",IS312,HONEYWELL,"ADI - Gardiner",IS312B,"Sécurité Communications SAS",,ANPI,a,07/04/2021,25/02/2022,"T 031",,,Nouveau
B-893-0017,Central,"C017-L-E1 [FX100+]",HONEYWELL,"ADI - Gardiner","C016-L-E1 (FX050+), C015-L-E1 (FX020+)","Honeywell Security",,ANPI,0,19/12/2016,28/12/2020,"T 014",,,
B-893-0018,Central,"C006-S-E1 [FX050]",HONEYWELL,"ADI - Gardiner","C005-S-E1 (FX020)","Honeywell Security",,ANPI,0,19/12/2016,28/12/2020,"T 014",,,
C-010-1375,Interface,C072-xx,HONEYWELL,"Honeywell Security",,"Honeywell Security Nederland B.V.",,"Kiwa Nederland B.V.",0,23/11/2017,28/12/2020,"T 014",,,
B-893-1001,"Dispositif de MES/MHS non filaire","TCPA2B [GE-II]",HONEYWELL,"Honeywell Security",,"Honeywell Security",,ANPI,0,18/01/2017,22/09/2019,"T 033",,,
B-893-1001,"Dispositif de MES/MHS non filaire","TCPA2B [GE-II]",HONEYWELL,"Honeywell Security",,"Honeywell Security",,ANPI,a,23/09/2019,22/09/2022,"T 033",,"Reactivation by specific request from the licence holder",
B-893-1001,"Dispositif de MES/MHS non filaire","TCPA2B [GE-II]",HONEYWELL,"Honeywell Security",,"Honeywell Security",,ANPI,,01/06/2019,02/09/2019,,,"INCERT 011 - Règlement financier",Suspension
B-893-1001,"Dispositif de MES/MHS non filaire","TCPA2B [GE-II]",HONEYWELL,"Honeywell Security",,"Honeywell Security",,ANPI,,23/04/2021,06/07/2021,,,"NC / INCERT 011",Suspension
B-893-1002,"Détecteur PIR",ISN3010B4,HONEYWELL,"Honeywell Security",,"Honeywell Security",,ANPI,0,06/03/2018,04/07/2018,"T 033",,,
B-893-1002,"Détecteur PIR",ISN3010B4,HONEYWELL,"Honeywell Security",,"Honeywell Security",,ANPI,a,05/07/2018,04/07/2021,"T 033",,,
B-893-1002,"Détecteur PIR",ISN3010B4,HONEYWELL,"Honeywell Security",,"Honeywell Security",,ANPI,,01/06/2019,02/09/2019,,,"INCERT 011 - Règlement financier",Suspension
B-893-1002,"Détecteur PIR",ISN3010B4,HONEYWELL,"Honeywell Security",,"Honeywell Security",,ANPI,,23/04/2021,06/07/2021,,,"NC / INCERT 011",Suspension
B-893-1003,"Clavier sans fil",LKPES8M-FR,HONEYWELL,"Honeywell Security",,"Honeywell Security",,ANPI,0,06/03/2018,22/09/2019,"T 033",,,
B-893-1003,"Clavier sans fil",LKPES8M-FR,HONEYWELL,"Honeywell Security",,"Honeywell Security",,ANPI,a,23/09/2019,22/09/2022,"T 033",,,
B-893-1003,"Clavier sans fil",LKPES8M-FR,HONEYWELL,"Honeywell Security",,"Honeywell Security",,ANPI,,01/06/2019,02/09/2019,,,"INCERT 011 - Règlement financier",Suspension
B-893-1003,"Clavier sans fil",LKPES8M-FR,HONEYWELL,"Honeywell Security",,"Honeywell Security",,ANPI,,23/04/2021,06/07/2021,,,"NC / INCERT 011",Suspension
B-893-1004,"Dispositif de MES/MHS non filaire",TCE800M,HONEYWELL,"Honeywell Security",,"Honeywell Security",,ANPI,0,06/03/2018,22/09/2019,"T 033",,,
B-893-1004,"Dispositif de MES/MHS non filaire",TCE800M,HONEYWELL,"Honeywell Security",,"Honeywell Security",,ANPI,a,23/09/2019,22/09/2022,"T 033",,,
B-893-1004,"Dispositif de MES/MHS non filaire",TCE800M,HONEYWELL,"Honeywell Security",,"Honeywell Security",,ANPI,,01/06/2019,02/09/2019,,,"INCERT 011 - Règlement financier",Suspension
B-893-1004,"Dispositif de MES/MHS non filaire",TCE800M,HONEYWELL,"Honeywell Security",,"Honeywell Security",,ANPI,,23/04/2021,06/07/2021,,,"NC / INCERT 011",Suspension
B-893-1005,Central,HMI8EU-STD8EG,HONEYWELL,"Honeywell Security",,"Honeywell Security",,ANPI,0,12/03/2018,26/11/2020,"T 033",,,
B-893-1005,Central,HMI8EU-STD8EG,HONEYWELL,"Honeywell Security",,"Honeywell Security",,ANPI,,01/06/2019,02/09/2019,,,"INCERT 011 - Règlement financier",Suspension
B-893-1005,Central,HMI8EU-STD8EG,HONEYWELL,"Honeywell Security",,"Honeywell Security",,ANPI,,23/04/2021,06/07/2021,,,"EN certificate not more valid + NC / INCERT 011",Suspension
B-893-0001,"Détecteur sismique",SC100,HONEYWELL,"Honeywell Security",SC105,"Honeywell Security",,ANPI,0,13/02/2013,12/02/2019,"T 014",,,
B-893-0002,Central,"C007-L-E1 [FX100]",HONEYWELL,"Honeywell Security Group Nederland","Galaxy Flex 50, Galaxy Flex 20","Honeywell Security",,ANPI,a,24/06/2014,23/06/2015,"T 014",,,
B-893-0002,Central,"C007-L-E1 [FX100]",HONEYWELL,"Honeywell Security Group Nederland","Galaxy Flex 50, Galaxy Flex 20","Honeywell Security",,ANPI,b,24/06/2015,31/12/2015,"T 014",,,
B-893-0002,Central,"C007-L-E1 [FX100]",HONEYWELL,"Honeywell Security Group Nederland","Galaxy Flex 50, Galaxy Flex 20","Honeywell Security",,ANPI,c,01/01/2016,15/12/2016,"T 014A",,,
B-893-0002,Central,"C007-L-E1 [FX100]",HONEYWELL,"Honeywell Security Group Nederland","Galaxy Flex 50, Galaxy Flex 20","Honeywell Security",,ANPI,d,16/12/2016,28/12/2020,"T 014",,,
B-893-0003,Clavier,"CP051-00-xx [MK8 PROX]",HONEYWELL,"ADI - Gardiner","MK8, CP038-xx (MK7 PROX), CP037-xx (MK7)","Honeywell Security",,ANPI,a,24/06/2014,23/06/2015,"T 014",,,
B-893-0003,Clavier,"CP051-00-xx [MK8 PROX]",HONEYWELL,"ADI - Gardiner","MK8, CP038-xx (MK7 PROX), CP037-xx (MK7)","Honeywell Security",,ANPI,b,24/06/2015,31/12/2015,"T 014",,,
B-893-0003,Clavier,"CP051-00-xx [MK8 PROX]",HONEYWELL,"ADI - Gardiner","MK8, CP038-xx (MK7 PROX), CP037-xx (MK7)","Honeywell Security",,ANPI,c,01/01/2016,18/12/2016,"T 014",,,
B-893-0003,Clavier,"CP051-00-xx [MK8 PROX]",HONEYWELL,"ADI - Gardiner","MK8, CP038-xx (MK7 PROX), CP037-xx (MK7)","Honeywell Security",,ANPI,d,19/12/2016,28/12/2020,"T 014",,,
B-893-0004,"Détecteur sismique","Viper GLX+ White",HONEYWELL,"Honeywell Security Group Nederland","Viper GLX+ Brown, Viper GLX White, Viper GLX Brown, Viper GL White, Viper GL Brown","Honeywell Security",,ANPI,0,05/06/2013,04/06/2019,"T 014",,,
B-893-0005,"Contact magnétique",DO800M,HONEYWELL,"Honeywell Security Group Nederland",DO8M,"Honeywell Security",,ANPI,0,29/07/2013,12/11/2014,"T 014",,,
B-893-0005,"Contact magnétique",DO800M,HONEYWELL,"Honeywell Security Group Nederland",DO8M,"Honeywell Security",,ANPI,a,13/11/2014,28/07/2019,"T 014",,,
B-893-0006,"Interface non filaire",C079-2,HONEYWELL,"Honeywell Security",A073-00-01,"Sécurité Communications SAS",,ANPI,0,29/07/2013,28/07/2019,"T 014A",,,
B-893-0007,Central,"Galaxy Dimension C520-D-XX",HONEYWELL,"ADI - Gardiner","Galaxy Dimension C264-D-XXGalaxy Dimension C096-D-XXGalaxy Dimension C048-D-XX","Honeywell Security",,ANPI,a,22/01/2014,13/04/2020,"T 014",,,
B-893-0007,Central,"Galaxy Dimension C520-D-XX",HONEYWELL,"ADI - Gardiner","Galaxy Dimension C264-D-XXGalaxy Dimension C096-D-XXGalaxy Dimension C048-D-XX","Honeywell Security",,ANPI,b,14/04/2020,28/12/2020,"T 014",,,
B-893-0008,"Détecteur PIR + US",DT8M,HONEYWELL,"Honeywell Security Group Nederland",DTPI8M,"Honeywell Security",,ANPI,a,24/06/2014,23/06/2015,"T 014",,,
B-893-0008,"Détecteur PIR + US",DT8M,HONEYWELL,"Honeywell Security Group Nederland",DTPI8M,"Honeywell Security",,ANPI,b,24/06/2015,31/12/2015,"T 014",,,
B-893-0009,"Transmetteur digital",A083-00-01,HONEYWELL,"Honeywell Security Group Nederland",E080-04,"Honeywell Security",,ANPI,0,03/12/2013,28/12/2020,"T 014",,,
B-893-0010,"Dispositif de MES/MHS",TCC800M,HONEYWELL,"Honeywell Security Group Nederland",,"Honeywell Security",,ANPI,0,22/01/2014,28/12/2020,"T 014",,,
B-893-0011,"Transmetteur digital",A081-00-01,HONEYWELL,"ADI - Gardiner",,"Honeywell Security",,ANPI,0,22/01/2014,21/01/2020,"T 014",,,
B-893-0012,"Détecteur PIR + MW, anti-masking",DT8016AF4,HONEYWELL,"Honeywell Security Group Nederland",,"Honeywell Security",,ANPI,0,07/07/2014,06/07/2020,"T 014",,,
B-893-0013,"Détecteur PIR, anti-masking",IS3016A,HONEYWELL,"Honeywell Security Group Nederland",,"Honeywell Security",,ANPI,a,03/10/2014,06/07/2020,"T 014",,,
C-004-0074,Central,"Galaxy 512",HONEYWELL,"Alarm International Systems [AIS]","Galaxy 10/18, Galaxy 12/60, Galaxy 128, Galaxy 500, Galaxy 504, Galaxy 8, Star 16, Star 16 Com","Alarm International Systems [AIS]",,"Kiwa Nederland B.V.",0,14/10/2009,24/06/2015,"T 014",,,
C-004-0093,Interface,"Galaxy Smart PSU",HONEYWELL,"Alarm International Systems [AIS]","Interface 4Rel. BOX, Interface 4Rel. PCB, RIO Galaxy BOX, RIO Galaxy PCB","Alarm International Systems [AIS]",,"Kiwa Nederland B.V.",0,14/10/2009,11/08/2015,"T 014",,,
C-004-0097,"Contact magnétique non filaire",5816H,HONEYWELL,"Alarm International Systems [AIS]",,"Alarm International Systems [AIS]",,"Kiwa Nederland B.V.",0,14/10/2009,14/10/2015,"T 014",,,
C-004-0098,Transmetteur,"Telecom module CTR21",HONEYWELL,"Alarm International Systems [AIS]",,"Alarm International Systems [AIS]",,"Kiwa Nederland B.V.",0,21/12/2009,27/08/2015,"T 014",,,
C-004-0099,Boîtier,"Galaxy Box",HONEYWELL,"Alarm International Systems [AIS]",,"Alarm International Systems [AIS]",,"Kiwa Nederland B.V.",0,14/10/2009,27/08/2015,"T 014",,,
C-004-0100,"Alimentation auxiliaire","Galaxy 1A PSU",HONEYWELL,"Alarm International Systems [AIS]","Galaxy 3A PSU","Alarm International Systems [AIS]",,"Kiwa Nederland B.V.",0,16/10/2009,27/08/2015,"T 014",,,
C-010-0085,"détecteur PIR + MWPIR + MW",DT-7235EU,HONEYWELL,"Honeywell Security & Communications",,"Sécurité Communications SAS",,"Kiwa Nederland B.V.",0,25/06/2003,25/06/2015,"T 014",,,
C-010-0143,"Support de montage",SMB-10T,HONEYWELL,"Honeywell Security & Communications",,"Sécurité Communications SAS",,"Kiwa Nederland B.V.",0,26/02/2004,26/02/2016,"T 014",,,
C-010-0154,"Détecteur bris de vitre",FG-1025Z,HONEYWELL,"Honeywell Security & Communications",,"Sécurité Communications SAS",,"Kiwa Nederland B.V.",0,29/03/2004,29/03/2016,"T 014",,,
C-010-0198,"Contact magnétique non filaire",5814H,HONEYWELL,"Honeywell Security Nederland B.V.",,"Sécurité Communications SAS",,"Kiwa Nederland B.V.",0,28/09/2004,28/09/2010,"T 014",,,
C-010-0199,"détecteur PIR + MWPIR + MW",DT-900,HONEYWELL,"Honeywell Security & Communications",DT-906,"Sécurité Communications SAS",,"Kiwa Nederland B.V.",0,28/09/2004,28/09/2016,"T 014",,,
C-010-0268,Interface,E080,HONEYWELL,"Honeywell Security & Communications",E080-2,"Sécurité Communications SAS",,"Kiwa Nederland B.V.",0,09/09/2009,22/07/2017,"T 014",,,
C-010-0271,"Détecteur PIR",IS215TCE,HONEYWELL,"Honeywell International Inc",,"Sécurité Communications SAS",,"Kiwa Nederland B.V.",0,23/09/2005,23/09/2011,"T 014",,,
C-010-0279,"Détecteur PIR",IS2535T,HONEYWELL,"Honeywell International Inc","IS2535, IS2560T","Sécurité Communications SAS",,"Kiwa Nederland B.V.",0,20/10/2005,20/10/2011,"T 014",,,
C-010-0287,"Détecteur PIR",IS2535TC,HONEYWELL,"Honeywell Security Nederland B.V.","IS25100TC, IS2535TC (Pet Immune lens variant), IS2560TC","Sécurité Communications SAS",,"Kiwa Nederland B.V.",0,26/01/2006,26/01/2012,"T 014",,,
C-010-0312,Central,C520-xx-C,HONEYWELL,"Honeywell Security Nederland B.V.","(xx : denotes the country or customer destination), Galaxy 3 : C520-xx-C, C520-xx, C144-xx-C, C144-x","Sécurité Communications SAS",,"Kiwa Nederland B.V.",0,30/06/2006,30/06/2012,"T 014",,,
C-010-0313,"Alimentation auxiliaire",P026,HONEYWELL,"Honeywell Security Nederland B.V.","Galaxy Power Rio : P025, P026, P027","Sécurité Communications SAS",,"Kiwa Nederland B.V.",0,30/06/2006,30/06/2012,"T 014",,,
C-010-0314,"Transmetteur non filaire","C077 [RF Portal]",HONEYWELL,"Honeywell Security & Communications",,"Sécurité Communications SAS",,"Kiwa Nederland B.V.",0,30/06/2006,30/06/2012,"T 014A",,,
C-010-0315,Central,C043-xx,HONEYWELL,"Honeywell Security","(xx : denotes the country or customer destination), Galaxy 2 : C020-xx (V1.44), Galaxy 2 : C043-xx-C","Sécurité Communications SAS",,"Kiwa Nederland B.V.",0,28/09/2009,30/06/2018,"T 014",,,
C-010-0316,Central,"C044-xx-C [V1.44]",HONEYWELL,"Honeywell Security","(xx : denotes the country or customer destination)","Sécurité Communications SAS",,"Kiwa Nederland B.V.",0,11/09/2009,08/10/2016,"T 014",,,
C-010-0325,Clavier,"Galaxy MK7 Keyprox CP037-xx",HONEYWELL,"Honeywell Security & Communications","Galaxy MK7 Keyprox CP038-xx, Galaxy MK7 Keyprox CP038-xx-H","Sécurité Communications SAS",,"Kiwa Nederland B.V.",0,16/07/2009,30/06/2015,"T 014",,,
C-010-0381,"Détecteur PIR",IS215TCE-MIC,HONEYWELL,"Honeywell Security & Communications",,"Sécurité Communications SAS",,"Kiwa Nederland B.V.",0,01/12/2010,12/09/2013,"T 014",,,
C-010-0384,"Alimentation auxiliaire",P026-01-B,HONEYWELL,"Honeywell Security & Communications",,"Sécurité Communications SAS",,"Kiwa Nederland B.V.",0,01/12/2010,19/11/2013,"T 014",,,
C-010-0384,"Alimentation auxiliaire",P026-01-B,HONEYWELL,"Honeywell Security & Communications",,"Sécurité Communications SAS",,"Kiwa Nederland B.V.",a,20/11/2013,19/11/2019,"T 014",,,
C-010-0392,"Transmetteur non filaire","C079 [RF Portal]",HONEYWELL,"Honeywell Security & Communications",,"Sécurité Communications SAS",,"Kiwa Nederland B.V.",0,21/01/2008,17/01/2011,"T 014A",,,
C-010-0446,Central,"Galaxy Dimension",HONEYWELL,"Honeywell Security & Communications","C048-C-xx, C096-C-xx, C264-C-xx, C520-C-xx (xx denotes the language)","Sécurité Communications SAS",,"Kiwa Nederland B.V.",0,24/04/2009,24/04/2015,"T 014",,,
C-010-0453,Clavier,CP040-XX,HONEYWELL,"Honeywell Security & Communications","CP040-XX (XX denotes the territory and language)","Sécurité Communications SAS",,"Kiwa Nederland B.V.",0,16/09/2009,16/09/2015,"T 014",,,
C-010-0531,Clavier,CP042-XX,HONEYWELL,"Honeywell Security & Communications","CP041-XX, CP042-XX (XX denotes the territory and language)","Sécurité Communications SAS",,"Kiwa Nederland B.V.",0,17/02/2011,17/02/2017,"T 014",,,
C-010-0578,"Détecteur de bris de vitre",FG8M,HONEYWELL,"Honeywell Security & Communications",,"Sécurité Communications SAS",,"Kiwa Nederland B.V.",0,16/05/2012,16/05/2018,"T 014A",,,
C-010-0580,"Détecteur PIR non filaire",IRPI800M,HONEYWELL,"Honeywell Security & Communications","IR8M, IRPI8M","Sécurité Communications SAS",,"Kiwa Nederland B.V.",0,18/06/2012,18/06/2018,"T 014A",,,
C-010-0599,"Détecteur sismique non filaire",SHK8M,HONEYWELL,"Honeywell Security & Communications",,"Sécurité Communications SAS",,"Kiwa Nederland B.V.",0,24/10/2012,30/06/2015,"T 014A",,,
C-010-0600,"Détecteur sismique non filaire",SHKC8M,HONEYWELL,"Honeywell Security & Communications",SHKC8M2,"Sécurité Communications SAS",,"Kiwa Nederland B.V.",0,24/10/2012,30/06/2015,"T 014A",,,
B-626-0003,"Transmetteur digital","Galaxy GT-40",HONEYWELL,"Honeywell Security","Galaxy GT-20Galaxy GT-00","Chiron Security Communications",,ANPI,b,19/03/2014,11/06/2018,"T 014",,,
B-B93-1004,"Détecteur PIR",IS3016M-SN,HONEYWELL,"Honeywell Security",,"Honeywell Security UK Ltd",,ANPI,0,24/09/2020,01/01/2023,"T 033",,,Prolongation
B-B93-1004,"Détecteur PIR",IS3016M-SN,HONEYWELL,"Honeywell Security",,"Honeywell Security UK Ltd",,ANPI,a,14/09/2020,01/01/2023,"T 033 Ed 2 (2018)",,,Nouveau
B-B93-1004,"Détecteur PIR",IS3016M-SN,HONEYWELL,"Honeywell Security",,"Honeywell Security UK Ltd",,ANPI,b,02/01/2023,01/01/2025,"T 033 Ed 2 (2018)",,"update EN certificate",Nouveau