﻿"Numéro de certificat","Catégorie de produit",Type,Marque,Distributeur,Variant,Détenteur,E-mail,Certificateur,Version,"Date de début","Date de fin",Référence,"Référence 2",Remarque,Statut
TT4-B-748-0010,TT4,"MBB Porsche TT4","Continental Automotive GmbH","Porsche Center Bruxelles - Porsche Import",,"Porsche Centre Brussels",sales@pcb.porsche.be,ANPI,0,04/09/2018,20/02/2019,"T 021C",,,
TT4-B-748-0010,TT4,"MBB Porsche TT4","Continental Automotive GmbH","Porsche Center Bruxelles - Porsche Import",,"Porsche Centre Brussels",sales@pcb.porsche.be,ANPI,a,21/02/2019,14/04/2020,"T 021C",,,
TT4-B-748-0010,TT4,"MBB Porsche TT4","Continental Automotive GmbH","Porsche Center Bruxelles - Porsche Import",,"Porsche Centre Brussels",sales@pcb.porsche.be,ANPI,b,15/04/2020,03/09/2024,"T 021C",,,Prolongation
TT4-B-748-0010,TT4,"MBB Porsche TT4","Continental Automotive GmbH","Porsche Center Bruxelles - Porsche Import",,"Porsche Centre Brussels",sales@pcb.porsche.be,ANPI,,28/06/2023,26/07/2023,,,,Suspension
TT4-B-748-0002,TT4,"Porsche VTS ICD 40 TT4",Porsche,"Porsche Center Bruxelles - Porsche Import",,"Porsche Centre Brussels",sales@pcb.porsche.be,ANPI,0,23/03/2011,22/03/2014,"T 021C",,,
TT4-B-748-0002,TT4,"Porsche VTS ICD 40 TT4",Porsche,"Porsche Center Bruxelles - Porsche Import",,"Porsche Centre Brussels",sales@pcb.porsche.be,ANPI,a,23/03/2014,31/03/2024,"T 021C",,,Prolongation
TT4-B-748-0002,TT4,"Porsche VTS ICD 40 TT4",Porsche,"Porsche Center Bruxelles - Porsche Import",,"Porsche Centre Brussels",sales@pcb.porsche.be,ANPI,,28/06/2023,26/07/2023,,,"Suspension en attendant le renouvellement",Suspension
TT4-B-748-0006,TT4,"Car Connect VTS TT4",Porsche,"Porsche Center Bruxelles - Porsche Import",,"Porsche Centre Brussels",sales@pcb.porsche.be,ANPI,0,05/12/2013,16/02/2015,"T 021C",,,
TT4-B-748-0006,TT4,"Car Connect VTS TT4",Porsche,"Porsche Center Bruxelles - Porsche Import",,"Porsche Centre Brussels",sales@pcb.porsche.be,ANPI,a,17/02/2015,31/03/2024,"T 021C",,,Prolongation
TT4-B-748-0006,TT4,"Car Connect VTS TT4",Porsche,"Porsche Center Bruxelles - Porsche Import",,"Porsche Centre Brussels",sales@pcb.porsche.be,ANPI,,28/06/2023,26/07/2023,,,"Suspension en attendant le renouvellement",Suspension