﻿"Numéro de certificat","Catégorie de produit",Type,Marque,Distributeur,Variant,Détenteur,E-mail,Certificateur,Version,"Date de début","Date de fin",Référence,"Référence 2",Remarque,Statut
C-035-0604,Central,SCW9057D-433,DSC,"Digital Security Controls","SCW9055-433, SCW9055G-433, SCW9057-433, SCW9057G-433","Digital Security Controls, a div. of Tyco Safety Products Canada Ltd.",,"Kiwa Nederland B.V.",0,08/04/2013,30/06/2015,"T 014A",,,
C-035-0638,Transmetteur,GS3125-BA,DSC,"Digital Security Controls","GS3105-K, GS3125-K","Digital Security Controls, a div. of Tyco Safety Products Canada Ltd.",,"Kiwa Nederland B.V.",0,09/08/2013,09/08/2019,"T 014A",,,
C-035-1020,"Contact magnétique non filaire",PG8945,DSC,"RIMEX  S.A.",,"Digital Security Controls, a div. of Tyco Safety Products Canada Ltd.",,"Kiwa Nederland B.V.",0,03/09/2014,02/09/2020,"T 014A",,,
C-035-1064,"Détecteur PIR non filaire",PG8904,DSC,"Digital Security Controls, a div. of Tyco Safety Products Canada Ltd.",PG8904P,"Digital Security Controls, a div. of Tyco Safety Products Canada Ltd.",,"Kiwa Nederland B.V.",0,04/12/2014,30/06/2015,"T 014A",,,
C-035-1064,"Détecteur PIR non filaire",PG8904,DSC,"Digital Security Controls, a div. of Tyco Safety Products Canada Ltd.",PG8904P,"Digital Security Controls, a div. of Tyco Safety Products Canada Ltd.",,"Kiwa Nederland B.V.",a,01/07/2015,14/11/2019,"T 031",,,
C-035-1064,"Détecteur PIR non filaire",PG8904,DSC,"Digital Security Controls, a div. of Tyco Safety Products Canada Ltd.",PG8904P,"Digital Security Controls, a div. of Tyco Safety Products Canada Ltd.",,"Kiwa Nederland B.V.",b,15/11/2019,01/07/2021,"T 031",,,
C-035-1065,"Détecteur PIR non filaire",PG8934,,"Digital Security Controls, a div. of Tyco Safety Products Canada Ltd.",,"Digital Security Controls, a div. of Tyco Safety Products Canada Ltd.",,"Kiwa Nederland B.V.",0,04/12/2014,30/06/2015,"T 014A",,,
C-035-1065,"Détecteur PIR non filaire",PG8934,Tyco,"Digital Security Controls, a div. of Tyco Safety Products Canada Ltd.",,"Digital Security Controls, a div. of Tyco Safety Products Canada Ltd.",,"Kiwa Nederland B.V.",a,01/07/2015,14/11/2019,"T 031",,,
C-035-1065,"Détecteur PIR non filaire",PG8934,Tyco,"Digital Security Controls, a div. of Tyco Safety Products Canada Ltd.",,"Digital Security Controls, a div. of Tyco Safety Products Canada Ltd.",,"Kiwa Nederland B.V.",b,15/11/2019,25/01/2021,"T 031",,,
C-035-1065,"Détecteur PIR non filaire",PG8934,Tyco,"Digital Security Controls, a div. of Tyco Safety Products Canada Ltd.",,"Digital Security Controls, a div. of Tyco Safety Products Canada Ltd.",,"Kiwa Nederland B.V.",c,26/01/2021,12/03/2023,"T 031",,,
C-035-1065,"Détecteur PIR non filaire",PG8934,Tyco,"Digital Security Controls, a div. of Tyco Safety Products Canada Ltd.",,"Digital Security Controls, a div. of Tyco Safety Products Canada Ltd.",,"Kiwa Nederland B.V.",d,13/03/2023,20/02/2026,"T 031",,,Nouveau
C-035-1070,"Sirène intérieure non filaire",PG8901,DSC,"Digital Security Controls, a div. of Tyco Safety Products Canada Ltd.",,"Digital Security Controls, a div. of Tyco Safety Products Canada Ltd.",,"Kiwa Nederland B.V.",0,04/12/2014,30/06/2015,"T 014A",,,
C-035-1070,"Sirène intérieure non filaire",PG8901,DSC,"Digital Security Controls, a div. of Tyco Safety Products Canada Ltd.",,"Digital Security Controls, a div. of Tyco Safety Products Canada Ltd.",,"Kiwa Nederland B.V.",a,01/07/2015,14/11/2019,"T 014A",,,
C-035-1070,"Sirène intérieure non filaire",PG8901,DSC,"Digital Security Controls, a div. of Tyco Safety Products Canada Ltd.",,"Digital Security Controls, a div. of Tyco Safety Products Canada Ltd.",,"Kiwa Nederland B.V.",b,15/11/2019,29/12/2020,"T 014A",,,
C-035-1071,"Sirène extérieure non filaire",PG8911,DSC,"Digital Security Controls, a div. of Tyco Safety Products Canada Ltd.",,"Digital Security Controls, a div. of Tyco Safety Products Canada Ltd.",,"Kiwa Nederland B.V.",0,04/12/2014,30/06/2015,"T 014A",,,
C-035-1071,"Sirène extérieure non filaire",PG8911,DSC,"Digital Security Controls, a div. of Tyco Safety Products Canada Ltd.",,"Digital Security Controls, a div. of Tyco Safety Products Canada Ltd.",,"Kiwa Nederland B.V.",a,01/07/2015,14/11/2019,"T 014A",,,
C-035-1071,"Sirène extérieure non filaire",PG8911,DSC,"Digital Security Controls, a div. of Tyco Safety Products Canada Ltd.",,"Digital Security Controls, a div. of Tyco Safety Products Canada Ltd.",,"Kiwa Nederland B.V.",b,15/11/2019,29/12/2020,"T 014A",,,
C-035-1066,"Détecteur PIR non filaire",PG8924,DSC,"ANB Rimex",,"Digital Security Controls, a div. of Tyco Safety Products Canada Ltd.",,"Kiwa Nederland B.V.",0,05/12/2014,30/06/2015,"T 014A",,,
C-035-1066,"Détecteur PIR non filaire",PG8924,DSC,"ANB Rimex",,"Digital Security Controls, a div. of Tyco Safety Products Canada Ltd.",,"Kiwa Nederland B.V.",a,01/07/2015,28/12/2020,"T 014A",,,
C-035-1067,"Détecteur PIR non filaire",PG8974,,"Digital Security Controls, a div. of Tyco Safety Products Canada Ltd.",,"Digital Security Controls, a div. of Tyco Safety Products Canada Ltd.",,"Kiwa Nederland B.V.",0,05/12/2014,30/06/2015,"T 014A",,,
C-035-1067,"Détecteur PIR non filaire",PG8974,Tyco,"Digital Security Controls, a div. of Tyco Safety Products Canada Ltd.",,"Digital Security Controls, a div. of Tyco Safety Products Canada Ltd.",,"Kiwa Nederland B.V.",a,01/07/2015,14/11/2019,"T 031",,,
C-035-1067,"Détecteur PIR non filaire",PG8974,Tyco,"Digital Security Controls, a div. of Tyco Safety Products Canada Ltd.",,"Digital Security Controls, a div. of Tyco Safety Products Canada Ltd.",,"Kiwa Nederland B.V.",b,15/11/2019,25/01/2021,"T 031",,,
C-035-1067,"Détecteur PIR non filaire",PG8974,Tyco,"Digital Security Controls, a div. of Tyco Safety Products Canada Ltd.",,"Digital Security Controls, a div. of Tyco Safety Products Canada Ltd.",,"Kiwa Nederland B.V.",c,26/01/2021,12/03/2023,"T 031",,,
C-035-1067,"Détecteur PIR non filaire",PG8974,Tyco,"Digital Security Controls, a div. of Tyco Safety Products Canada Ltd.",,"Digital Security Controls, a div. of Tyco Safety Products Canada Ltd.",,"Kiwa Nederland B.V.",d,13/03/2023,20/02/2026,"T 031",,,Nouveau
C-035-1068,"Dispositif de MES/MHS non filaire",PG8939,DSC,"Digital Security Controls, a div. of Tyco Safety Products Canada Ltd.",,"Digital Security Controls, a div. of Tyco Safety Products Canada Ltd.",,"Kiwa Nederland B.V.",0,05/12/2014,30/06/2015,"T 014A",,,
C-035-1068,"Dispositif de MES/MHS non filaire",PG8939,DSC,"Digital Security Controls, a div. of Tyco Safety Products Canada Ltd.",,"Digital Security Controls, a div. of Tyco Safety Products Canada Ltd.",,"Kiwa Nederland B.V.",a,01/07/2015,14/11/2019,"T 014A",,,
C-035-1068,"Dispositif de MES/MHS non filaire",PG8939,DSC,"Digital Security Controls, a div. of Tyco Safety Products Canada Ltd.",,"Digital Security Controls, a div. of Tyco Safety Products Canada Ltd.",,"Kiwa Nederland B.V.",b,15/11/2019,29/12/2020,"T 014A",,,
C-035-1069,"Dispositif de MES/MHS non filaire",PG8929,DSC,"Digital Security Controls, a div. of Tyco Safety Products Canada Ltd.",,"Digital Security Controls, a div. of Tyco Safety Products Canada Ltd.",,"Kiwa Nederland B.V.",0,05/12/2014,30/06/2015,"T 014A",,,
C-035-1069,"Dispositif de MES/MHS non filaire",PG8929,DSC,"Digital Security Controls, a div. of Tyco Safety Products Canada Ltd.",,"Digital Security Controls, a div. of Tyco Safety Products Canada Ltd.",,"Kiwa Nederland B.V.",a,01/07/2015,14/11/2019,"T 014A",,,
C-035-1069,"Dispositif de MES/MHS non filaire",PG8929,DSC,"Digital Security Controls, a div. of Tyco Safety Products Canada Ltd.",,"Digital Security Controls, a div. of Tyco Safety Products Canada Ltd.",,"Kiwa Nederland B.V.",b,15/11/2019,29/12/2020,"T 014A",,,
C-035-1072,"Transmetteur non filaire",PG8920,DSC,"Digital Security Controls, a div. of Tyco Safety Products Canada Ltd.",,"Digital Security Controls, a div. of Tyco Safety Products Canada Ltd.",,"Kiwa Nederland B.V.",0,05/12/2014,30/06/2015,"T 014A",,,
C-035-1072,"Transmetteur non filaire",PG8920,DSC,"Digital Security Controls, a div. of Tyco Safety Products Canada Ltd.",,"Digital Security Controls, a div. of Tyco Safety Products Canada Ltd.",,"Kiwa Nederland B.V.",a,01/07/2015,14/11/2019,"T 014A",,,
C-035-1072,"Transmetteur non filaire",PG8920,DSC,"Digital Security Controls, a div. of Tyco Safety Products Canada Ltd.",,"Digital Security Controls, a div. of Tyco Safety Products Canada Ltd.",,"Kiwa Nederland B.V.",b,15/11/2019,29/12/2020,"T 014A",,,
C-035-1015,"Transmetteur numérique",TL2803GR-EU,DSC,"AnB S.A.","TL2803G-EU, 3G2080R-EU, 3G2080-EU, TL280R, TL280","Digital Security Controls, a div. of Tyco Safety Products Canada Ltd.",,"Kiwa Nederland B.V.",0,30/01/2015,29/12/2020,"T 014",,,
C-035-1010,Interface,HSM2208,DSC,"AnB S.A.",,"Digital Security Controls, a div. of Tyco Safety Products Canada Ltd.",,"Kiwa Nederland B.V.",0,25/02/2015,29/12/2020,"T 014",,,
C-035-1016,"Clavier sans fil",HS2LCDWFPV8,DSC,"AnB S.A.","HS2LCDWFP8, HS2LCDWF8","Digital Security Controls, a div. of Tyco Safety Products Canada Ltd.",,"Kiwa Nederland B.V.",0,27/02/2015,29/12/2020,"T 014A",,,
C-035-1073,Interface,HSM2108,DSC,"ANB Rimex",,"Digital Security Controls, a div. of Tyco Safety Products Canada Ltd.",,"Kiwa Nederland B.V.",0,13/03/2015,28/12/2020,"T 014",,,
C-035-1017,Clavier,HS2LED,DSC,"ANB Rimex",,"Digital Security Controls, a div. of Tyco Safety Products Canada Ltd.",,"Kiwa Nederland B.V.",0,13/03/2015,29/12/2020,"T 014",,,
C-035-1018,"Interface non filaire",HSM2HOST8,DSC,"ANB Rimex",,"Digital Security Controls, a div. of Tyco Safety Products Canada Ltd.",,"Kiwa Nederland B.V.",0,13/03/2015,29/12/2020,"T 014A",,,
C-035-1012,Clavier,HS2LCDP,DSC,"ANB Rimex","HS2LCD, HS2ICNP, HS2ICN","Digital Security Controls, a div. of Tyco Safety Products Canada Ltd.",,"Kiwa Nederland B.V.",0,23/03/2015,29/12/2020,"T 014",,,
C-035-1021,"Clavier sans fil",PG8949,DSC,"ANB Rimex",PG8938,"Digital Security Controls, a div. of Tyco Safety Products Canada Ltd.",,"Kiwa Nederland B.V.",0,23/03/2015,29/12/2020,"T 014A",,,
C-035-1013,Clavier,HS2LCDRFP8,DSC,"ANB Rimex","HS2LCDRF8, H2ICNRFP8,, HS2ICNRF8","Digital Security Controls, a div. of Tyco Safety Products Canada Ltd.",,"Kiwa Nederland B.V.",0,24/03/2015,29/12/2020,"T 014A",,,
C-035-1009,Central,HS2128,DSC,"Digital Security Controls, a div. of Tyco Safety Products Canada Ltd.","HS2064, HS2032, HS2016","Digital Security Controls, a div. of Tyco Safety Products Canada Ltd.",,"Kiwa Nederland B.V.",0,26/03/2015,06/06/2017,"T 014",,,
C-035-1009,Central,HS2128,DSC,"Digital Security Controls, a div. of Tyco Safety Products Canada Ltd.","HS2064, HS2032, HS2016","Digital Security Controls, a div. of Tyco Safety Products Canada Ltd.",,"Kiwa Nederland B.V.",a,07/06/2017,14/11/2019,"T 014",,,
C-035-1009,Central,HS2128,DSC,"Digital Security Controls, a div. of Tyco Safety Products Canada Ltd.","HS2064, HS2032, HS2016","Digital Security Controls, a div. of Tyco Safety Products Canada Ltd.",,"Kiwa Nederland B.V.",b,15/11/2019,29/12/2020,"T 014",,,
C-035-1014,"Alimentation auxiliaire",HSM2204,DSC,"ANB Rimex",,"Digital Security Controls, a div. of Tyco Safety Products Canada Ltd.",,"Kiwa Nederland B.V.",0,09/04/2015,29/12/2020,"T 014",,,
C-035-1257,Clavier,HS2TCHP,,"Digital Security Controls, a div. of Tyco Safety Products Canada Ltd.","HS2TCHPRO, HS2TCHPROBLK","Digital Security Controls, a div. of Tyco Safety Products Canada Ltd.",,"Kiwa Nederland B.V.",0,22/07/2016,20/12/2018,"T 031",,,
C-035-1257,Clavier,HS2TCHP,DSC/Tyco,"Digital Security Controls, a div. of Tyco Safety Products Canada Ltd.","HS2TCHPRO, HS2TCHPROBLK","Digital Security Controls, a div. of Tyco Safety Products Canada Ltd.",,"Kiwa Nederland B.V.",a,21/12/2018,14/05/2019,"T 031",,,
C-035-1257,Clavier,HS2TCHP,DSC/Tyco,"Digital Security Controls, a div. of Tyco Safety Products Canada Ltd.","HS2TCHPRO, HS2TCHPROBLK","Digital Security Controls, a div. of Tyco Safety Products Canada Ltd.",,"Kiwa Nederland B.V.",b,15/05/2019,08/09/2021,"T 031",,,
C-035-1257,Clavier,HS2TCHP,DSC/Tyco,"Digital Security Controls, a div. of Tyco Safety Products Canada Ltd.","HS2TCHPRO, HS2TCHPROBLK","Digital Security Controls, a div. of Tyco Safety Products Canada Ltd.",,"Kiwa Nederland B.V.",c,09/09/2021,12/03/2023,"T 031",,,Nouveau
C-035-1257,Clavier,HS2TCHP,DSC/Tyco,"Digital Security Controls, a div. of Tyco Safety Products Canada Ltd.","HS2TCHPRO, HS2TCHPROBLK","Digital Security Controls, a div. of Tyco Safety Products Canada Ltd.",,"Kiwa Nederland B.V.",d,13/03/2023,09/09/2027,"T 031",,,Nouveau
C-035-1258,Transmetteur,"TL2803GE-EU, TL2803GE-EU",,"Digital Security Controls, a div. of Tyco Safety Products Canada Ltd.","3G2080RE-EU, 3G2080E-EU, TL280RE, TL280E, TL280LE-EU, LE2080-EU","Digital Security Controls, a div. of Tyco Safety Products Canada Ltd.",,"Kiwa Nederland B.V.",0,22/07/2016,14/11/2019,"T 031",,,
C-035-1258,Transmetteur,"TL2803GE-EU, TL2803GE-EU",DSC/Tyco,"Digital Security Controls, a div. of Tyco Safety Products Canada Ltd.","3G2080RE-EU, 3G2080E-EU, TL280RE, TL280E, TL280LE-EU, LE2080-EU","Digital Security Controls, a div. of Tyco Safety Products Canada Ltd.",,"Kiwa Nederland B.V.",a,15/11/2019,08/04/2021,"T 031",,,
C-035-1258,Transmetteur,"TL2803GE-EU, TL2803GE-EU",DSC/Tyco,"Digital Security Controls, a div. of Tyco Safety Products Canada Ltd.","3G2080RE-EU, 3G2080E-EU, TL280RE, TL280E, TL280LE-EU, LE2080-EU","Digital Security Controls, a div. of Tyco Safety Products Canada Ltd.",,"Kiwa Nederland B.V.",b,09/04/2021,14/06/2022,"T 031",,,Nouveau
C-035-1258,Transmetteur,"TL2803GE-EU, TL2803GE-EU",DSC/Tyco,"Digital Security Controls, a div. of Tyco Safety Products Canada Ltd.","3G2080RE-EU, 3G2080E-EU, TL280RE, TL280E, TL280LE-EU, LE2080-EU","Digital Security Controls, a div. of Tyco Safety Products Canada Ltd.",,"Kiwa Nederland B.V.",c,15/06/2022,18/03/2023,"T 031",,,Nouveau
C-035-1258,Transmetteur,"TL2803GE-EU, TL2803GE-EU",DSC/Tyco,"Digital Security Controls, a div. of Tyco Safety Products Canada Ltd.","3G2080RE-EU, 3G2080E-EU, TL280RE, TL280E, TL280LE-EU, LE2080-EU","Digital Security Controls, a div. of Tyco Safety Products Canada Ltd.",,"Kiwa Nederland B.V.",d,19/03/2023,15/06/2028,"T 031",,,Nouveau
C-035-1259,"Détecteur PIR non filaire",WS4904,DSC,"Digital Security Controls, a div. of Tyco Safety Products Canada Ltd.",WS4904P,"Digital Security Controls, a div. of Tyco Safety Products Canada Ltd.",,"Kiwa Nederland B.V.",0,09/09/2016,14/11/2019,"T 031",,,
C-035-1259,"Détecteur PIR non filaire",WS4904,DSC,"Digital Security Controls, a div. of Tyco Safety Products Canada Ltd.",WS4904P,"Digital Security Controls, a div. of Tyco Safety Products Canada Ltd.",,"Kiwa Nederland B.V.",a,15/11/2019,08/09/2022,"T 031",,,
C-035-1260,"Contact magnétique non filaire",WS4945,DSC,"Digital Security Controls, a div. of Tyco Safety Products Canada Ltd.",,"Digital Security Controls, a div. of Tyco Safety Products Canada Ltd.",,"Kiwa Nederland B.V.",0,09/09/2016,14/11/2019,"T 031",,,
C-035-1260,"Contact magnétique non filaire",WS4945,DSC,"Digital Security Controls, a div. of Tyco Safety Products Canada Ltd.",,"Digital Security Controls, a div. of Tyco Safety Products Canada Ltd.",,"Kiwa Nederland B.V.",a,15/11/2019,08/09/2022,"T 031",,,
C-035-1261,"Dispositif de MES/MHS non filaire",WS4939,DSC,"Digital Security Controls, a div. of Tyco Safety Products Canada Ltd.",,"Digital Security Controls, a div. of Tyco Safety Products Canada Ltd.",,"Kiwa Nederland B.V.",0,15/09/2016,14/11/2019,"T 031",,,
C-035-1261,"Dispositif de MES/MHS non filaire",WS4939,DSC,"Digital Security Controls, a div. of Tyco Safety Products Canada Ltd.",,"Digital Security Controls, a div. of Tyco Safety Products Canada Ltd.",,"Kiwa Nederland B.V.",a,15/11/2019,14/09/2022,"T 031",,,
C-035-1278,"Détecteur bris de vitre non filaire",PG8922,DSC,"Digital Security Controls, a div. of Tyco Safety Products Canada Ltd.",,"Digital Security Controls, a div. of Tyco Safety Products Canada Ltd.",,"Kiwa Nederland B.V.",0,25/01/2017,19/11/2019,"T 031",,,
C-035-1278,"Détecteur bris de vitre non filaire",PG8922,DSC,"Digital Security Controls, a div. of Tyco Safety Products Canada Ltd.",,"Digital Security Controls, a div. of Tyco Safety Products Canada Ltd.",,"Kiwa Nederland B.V.",a,20/11/2019,24/01/2023,"T 031",,,
C-035-1309,"Détecteur PIR non filaire",PG8914,Tyco,"Digital Security Controls",,"Digital Security Controls, a div. of Tyco Safety Products Canada Ltd.",,"Kiwa Nederland B.V.",0,23/03/2017,25/01/2021,"T 031",,,
C-035-1309,"Détecteur PIR non filaire",PG8914,Tyco,"Digital Security Controls",,"Digital Security Controls, a div. of Tyco Safety Products Canada Ltd.",,"Kiwa Nederland B.V.",a,26/01/2021,12/03/2023,"T 031",,,
C-035-1309,"Détecteur PIR non filaire",PG8914,Tyco,"Digital Security Controls",,"Digital Security Controls, a div. of Tyco Safety Products Canada Ltd.",,"Kiwa Nederland B.V.",b,13/03/2023,20/02/2026,"T 031",,,Nouveau
C-035-1418,Clavier,HS2LCDP,DSC/Tyco,"Digital Security Controls, a div. of Tyco Safety Products Canada Ltd.","HS2LCD, HS2LCDPRO","Digital Security Controls, a div. of Tyco Safety Products Canada Ltd.",,"Kiwa Nederland B.V.",0,21/12/2018,14/05/2019,"T 031",,,
C-035-1418,Clavier,HS2LCDP,DSC/Tyco,"Digital Security Controls, a div. of Tyco Safety Products Canada Ltd.","HS2LCD, HS2LCDPRO","Digital Security Controls, a div. of Tyco Safety Products Canada Ltd.",,"Kiwa Nederland B.V.",a,15/05/2019,01/09/2021,"T 031",,,
C-035-1418,Clavier,HS2LCDP,DSC/Tyco,"Digital Security Controls, a div. of Tyco Safety Products Canada Ltd.","HS2LCD, HS2LCDPRO","Digital Security Controls, a div. of Tyco Safety Products Canada Ltd.",,"Kiwa Nederland B.V.",b,02/09/2021,12/03/2023,"T 031",,,Nouveau
C-035-1418,Clavier,HS2LCDP,DSC/Tyco,"Digital Security Controls, a div. of Tyco Safety Products Canada Ltd.","HS2LCD, HS2LCDPRO","Digital Security Controls, a div. of Tyco Safety Products Canada Ltd.",,"Kiwa Nederland B.V.",c,13/03/2023,25/05/2024,"T 031",,,Nouveau
C-035-1415,Alimentation,HSM3350,DSC/Tyco,"Digital Security Controls",,"Digital Security Controls, a div. of Tyco Safety Products Canada Ltd.",,"Kiwa Nederland B.V.",0,21/12/2018,30/08/2021,"T 031",,,
C-035-1415,Alimentation,HSM3350,DSC/Tyco,"Digital Security Controls",,"Digital Security Controls, a div. of Tyco Safety Products Canada Ltd.",,"Kiwa Nederland B.V.",a,31/08/2021,12/03/2023,"T 031",,,Nouveau
C-035-1415,Alimentation,HSM3350,DSC/Tyco,"Digital Security Controls",,"Digital Security Controls, a div. of Tyco Safety Products Canada Ltd.",,"Kiwa Nederland B.V.",b,13/03/2023,25/05/2024,"T 031",,,Nouveau
C-035-1414,Alimentation,HSM3204CX,DSC/Tyco,"Digital Security Controls",,"Digital Security Controls, a div. of Tyco Safety Products Canada Ltd.",,"Kiwa Nederland B.V.",0,21/12/2018,29/08/2021,"T 031",,,
C-035-1414,Alimentation,HSM3204CX,DSC/Tyco,"Digital Security Controls",,"Digital Security Controls, a div. of Tyco Safety Products Canada Ltd.",,"Kiwa Nederland B.V.",a,30/08/2021,12/03/2023,"T 031",,,Nouveau
C-035-1414,Alimentation,HSM3204CX,DSC/Tyco,"Digital Security Controls",,"Digital Security Controls, a div. of Tyco Safety Products Canada Ltd.",,"Kiwa Nederland B.V.",b,13/03/2023,25/05/2024,"T 031",,,Nouveau
C-035-1417,"Interface non filaire",HSM2HOST8,DSC/Tyco,"Digital Security Controls, a div. of Tyco Safety Products Canada Ltd.",,"Digital Security Controls, a div. of Tyco Safety Products Canada Ltd.",,"Kiwa Nederland B.V.",0,21/12/2018,14/11/2019,"T 031",,,
C-035-1417,"Interface non filaire",HSM2HOST8,DSC/Tyco,"Digital Security Controls, a div. of Tyco Safety Products Canada Ltd.",,"Digital Security Controls, a div. of Tyco Safety Products Canada Ltd.",,"Kiwa Nederland B.V.",a,15/11/2019,26/08/2021,"T 031",,,
C-035-1417,"Interface non filaire",HSM2HOST8,DSC/Tyco,"Digital Security Controls, a div. of Tyco Safety Products Canada Ltd.",,"Digital Security Controls, a div. of Tyco Safety Products Canada Ltd.",,"Kiwa Nederland B.V.",b,27/08/2021,12/03/2023,"T 031",,,Nouveau
C-035-1417,"Interface non filaire",HSM2HOST8,DSC/Tyco,"Digital Security Controls, a div. of Tyco Safety Products Canada Ltd.",,"Digital Security Controls, a div. of Tyco Safety Products Canada Ltd.",,"Kiwa Nederland B.V.",c,13/03/2023,27/08/2027,"T 031",,,Nouveau
C-035-1411,Transmetteur,3G9080-EU,DSC/Tyco,"Digital Security Controls",LE9080-EU,"Digital Security Controls, a div. of Tyco Safety Products Canada Ltd.",,"Kiwa Nederland B.V.",0,21/12/2018,01/06/2021,"T 031",,,
C-035-1411,Transmetteur,3G9080-EU,DSC/Tyco,"Digital Security Controls",LE9080-EU,"Digital Security Controls, a div. of Tyco Safety Products Canada Ltd.",,"Kiwa Nederland B.V.",a,02/06/2021,12/10/2022,"T 031",,,Nouveau
C-035-1411,Transmetteur,3G9080-EU,DSC/Tyco,"Digital Security Controls",LE9080-EU,"Digital Security Controls, a div. of Tyco Safety Products Canada Ltd.",,"Kiwa Nederland B.V.",b,13/10/2022,18/03/2023,"T 031",,,Nouveau
C-035-1411,Transmetteur,3G9080-EU,DSC/Tyco,"Digital Security Controls",LE9080-EU,"Digital Security Controls, a div. of Tyco Safety Products Canada Ltd.",,"Kiwa Nederland B.V.",c,19/03/2023,13/10/2028,"T 031",,,Nouveau
C-035-1412,Interface,HSM3408,DSC/Tyco,"Digital Security Controls",,"Digital Security Controls, a div. of Tyco Safety Products Canada Ltd.",,"Kiwa Nederland B.V.",0,21/12/2018,24/08/2021,"T 031",,,
C-035-1412,Interface,HSM3408,DSC/Tyco,"Digital Security Controls",,"Digital Security Controls, a div. of Tyco Safety Products Canada Ltd.",,"Kiwa Nederland B.V.",a,25/08/2021,12/03/2023,"T 031",,,Nouveau
C-035-1412,Interface,HSM3408,DSC/Tyco,"Digital Security Controls",,"Digital Security Controls, a div. of Tyco Safety Products Canada Ltd.",,"Kiwa Nederland B.V.",b,13/03/2023,25/08/2027,"T 031",,,Nouveau
C-035-1413,Central,HS3128,DSC/Tyco,"Digital Security Controls, a div. of Tyco Safety Products Canada Ltd.","HS3128P, HS3032, HS3032P, HS3248, HS3248P","Digital Security Controls, a div. of Tyco Safety Products Canada Ltd.",,"Kiwa Nederland B.V.",0,21/12/2018,08/05/2019,"T 031",,,
C-035-1413,Central,HS3128,DSC/Tyco,"Digital Security Controls, a div. of Tyco Safety Products Canada Ltd.","HS3128P, HS3032, HS3032P, HS3248, HS3248P","Digital Security Controls, a div. of Tyco Safety Products Canada Ltd.",,"Kiwa Nederland B.V.",a,09/05/2019,29/08/2021,"T 031",,,
C-035-1413,Central,HS3128,DSC/Tyco,"Digital Security Controls, a div. of Tyco Safety Products Canada Ltd.","HS3128P, HS3032, HS3032P, HS3248, HS3248P","Digital Security Controls, a div. of Tyco Safety Products Canada Ltd.",,"Kiwa Nederland B.V.",b,30/08/2021,12/03/2023,"T 031",,,Nouveau
C-035-1413,Central,HS3128,DSC/Tyco,"Digital Security Controls, a div. of Tyco Safety Products Canada Ltd.","HS3128P, HS3032, HS3032P, HS3248, HS3248P","Digital Security Controls, a div. of Tyco Safety Products Canada Ltd.",,"Kiwa Nederland B.V.",c,13/03/2023,25/05/2024,"T 031",,,Nouveau
C-035-1432,"Détecteur PIR","PG8862 [868]",Tyco,"Digital Security Controls",,"Digital Security Controls, a div. of Tyco Safety Products Canada Ltd.",,"Kiwa Nederland B.V.",0,13/05/2019,12/03/2023,"T 031",,,
C-035-1432,"Détecteur PIR","PG8862 [868]",Tyco,"Digital Security Controls",,"Digital Security Controls, a div. of Tyco Safety Products Canada Ltd.",,"Kiwa Nederland B.V.",a,13/03/2023,12/05/2025,"T 031",,,Nouveau
C-035-1435,"Détecteur PIR non filaire","PG8902 [868]",Tyco,"Digital Security Controls",,"Digital Security Controls, a div. of Tyco Safety Products Canada Ltd.",,"Kiwa Nederland B.V.",0,24/06/2019,12/03/2023,"T 031",,,
C-035-1435,"Détecteur PIR non filaire","PG8902 [868]",Tyco,"Digital Security Controls",,"Digital Security Controls, a div. of Tyco Safety Products Canada Ltd.",,"Kiwa Nederland B.V.",a,13/03/2023,23/06/2025,"T 031",,,Nouveau
C-035-1421,Transmetteur,TL8803GI-EU,DSC/Tyco,"Digital Security Controls, a div. of Tyco Safety Products Canada Ltd.",,"Digital Security Controls, a div. of Tyco Safety Products Canada Ltd.",,"Kiwa Nederland B.V.",0,09/04/2019,14/11/2019,"T 031",,,