﻿"Numéro de certificat","Catégorie de produit",Type,Marque,Distributeur,Variant,Détenteur,E-mail,Certificateur,Version,"Date de début","Date de fin",Référence,"Référence 2",Remarque,Statut
TT1-B-978-0005,TT1,04-TT1,MasterSat,Geotracer,,Emixis,info@emixis.com,ANPI,0,21/05/2019,20/05/2022,"T 021C",,,
TT2-B-978-0006,TT2,04-TT2,MasterSat,Geotracer,,Emixis,info@emixis.com,ANPI,0,21/05/2019,20/05/2022,"T 021C",,,
TT3-B-978-0007,TT3,04-TT3,MasterSat,Geotracer,,Emixis,info@emixis.com,ANPI,0,21/05/2019,20/05/2022,"T 021C",,,
TT4-B-978-0008,TT4,04-TT4,MasterSat,Geotracer,,Emixis,info@emixis.com,ANPI,0,21/05/2019,20/05/2022,"T 021C",,,
TT1-B-978-0001,TT1,"SRV 4.0 TT1",Securysat,Geotracer,,Emixis,info@emixis.com,ANPI,0,21/05/2019,20/05/2024,"T 021C",,,Prolongation
TT2-B-978-0002,TT2,"SRV 4.0 TT2",Securysat,Geotracer,,Emixis,info@emixis.com,ANPI,0,21/05/2019,20/05/2024,"T 021C",,,Prolongation
TT3-B-978-0003,TT3,"SRV 4.0 TT3",Securysat,Geotracer,,Emixis,info@emixis.com,ANPI,0,21/05/2019,20/05/2024,"T 021C",,,Prolongation
TT4-B-978-0004,TT4,"SRV 4.0 TT4",Securysat,Geotracer,,Emixis,info@emixis.com,ANPI,0,21/05/2019,20/05/2024,"T 021C",,,Prolongation