﻿"Numéro de certificat","Catégorie de produit",Type,Marque,Distributeur,Variant,Détenteur,E-mail,Certificateur,Version,"Date de début","Date de fin",Référence,"Référence 2",Remarque,Statut
C-026-0420,Clavier,"Premier RKP4",TEXECOM,"Texecom Ltd.","Premier LCD, Premier LCD Blue, Premier LCD FMK, Premier LCD-P, Premier LCD-P FMK, Premier LCDL, Prem","Texecom Ltd.",,"Kiwa Nederland B.V.",0,19/12/2008,16/03/2015,"T 014",,,
C-027-0546,Clavier,JA-81E,Jablotron,"Jablotron Alarms a.s.",,"Jablotron Alarms a.s.",,"Kiwa Nederland B.V.",0,23/08/2011,31/12/2015,"T 014",,,
C-027-0546,Clavier,JA-81E,Jablotron,"Jablotron Alarms a.s.",,"Jablotron Alarms a.s.",,"Kiwa Nederland B.V.",a,01/01/2016,31/12/2021,"T 031",,,
C-033-0605,Clavier,RP432KPP,LIGHTSYS,"Risco Ltd.",RP432KP,"Risco Ltd.",,"Kiwa Nederland B.V.",0,25/03/2013,27/04/2015,"T 014",,,
C-033-0605,Clavier,RP432KPP,LIGHTSYS,"Risco Ltd.",RP432KP,"Risco Ltd.",,"Kiwa Nederland B.V.",a,28/04/2015,06/12/2017,"T 014",,,
C-033-0605,Clavier,RP432KPP,LIGHTSYS,"Risco Ltd.",RP432KP,"Risco Ltd.",,"Kiwa Nederland B.V.",b,07/12/2017,30/11/2020,"T 014",,,
C-033-0605,Clavier,RP432KPP,LIGHTSYS,"Risco Ltd.",RP432KP,"Risco Ltd.",,"Kiwa Nederland B.V.",c,01/12/2020,28/06/2021,"T 014",,,
C-036-0659,Clavier,T-WHITE,BENTEL,"Bentel Security S.r.l.",,"Bentel Security S.r.l.",,"Kiwa Nederland B.V.",0,19/11/2013,30/06/2015,"T 014",,,
C-036-0659,Clavier,T-WHITE,BENTEL,"Bentel Security S.r.l.",,"Bentel Security S.r.l.",,"Kiwa Nederland B.V.",a,15/12/2015,29/12/2020,"T 014",,,
C-040-0616,Clavier,"ergo [KSI2200000.300]","KSENIA SECURITY","Ksenia Security SRL","proxi [KS7600000.300]","Ksenia Security SRL",,"Kiwa Nederland B.V.",0,15/05/2013,30/06/2015,"T 014",,,
C-040-0616,Clavier,"ergo [KSI2200000.300]","KSENIA SECURITY","Ksenia Security SRL","proxi [KS7600000.300]","Ksenia Security SRL",,"Kiwa Nederland B.V.",a,14/08/2015,29/12/2020,"T 014",,,
C-041-0683,Clavier,LCDPROX1,TECNOALARM,"Tecnoalarm s.r.l.",,"Tecnoalarm s.r.l.",,"Kiwa Nederland B.V.",0,01/04/2014,01/04/2020,"T 014",,,
C-042-0668,Clavier,Joy/MAX,INIM,INIM,"Joy/GR, Concept/Gx (x = color), nCode/Gx (x = color)",INIM,,"Kiwa Nederland B.V.",0,26/11/2010,30/06/2015,"T 014",,,
C-042-0668,Clavier,Joy/MAX,INIM,INIM,"Joy/GR, Concept/Gx (x = color), nCode/Gx (x = color)",INIM,,"Kiwa Nederland B.V.",a,01/07/2015,21/12/2020,"T 014",,,
C-042-0668,Clavier,Joy/MAX,INIM,INIM,"Joy/GR, Concept/Gx (x = color), nCode/Gx (x = color)",INIM,,"Kiwa Nederland B.V.",b,22/12/2020,28/06/2021,"T 014",,,
C-036-1082,Clavier,"ABSOLUTA M-TOUCH",BENTEL,"AIS-Security Gosselies",,"Bentel Security S.r.l.",,"Kiwa Nederland B.V.",0,27/02/2015,29/12/2020,"T 014",,,
C-035-1017,Clavier,HS2LED,DSC,"ANB Rimex",,"Digital Security Controls, a div. of Tyco Safety Products Canada Ltd.",,"Kiwa Nederland B.V.",0,13/03/2015,29/12/2020,"T 014",,,
C-035-1012,Clavier,HS2LCDP,DSC,"ANB Rimex","HS2LCD, HS2ICNP, HS2ICN","Digital Security Controls, a div. of Tyco Safety Products Canada Ltd.",,"Kiwa Nederland B.V.",0,23/03/2015,29/12/2020,"T 014",,,
C-035-1013,Clavier,HS2LCDRFP8,DSC,"ANB Rimex","HS2LCDRF8, H2ICNRFP8,, HS2ICNRF8","Digital Security Controls, a div. of Tyco Safety Products Canada Ltd.",,"Kiwa Nederland B.V.",0,24/03/2015,29/12/2020,"T 014A",,,
C-026-1036,Clavier,DBD1000-2,TEXECOM,"ADI Global Distribution N.V.","DBA1000-2, DBB1000-2, DBC1000-2, DBD1010-2, DBD3000-2, DBD4000-2","Texecom Ltd.",,"Kiwa Nederland B.V.",0,08/05/2015,29/12/2020,"T 014",,,
B-958-0002,Clavier,SPCK623.100,"Siemens / Vanderbilt","Smartwares Safety & Lighting","SPCK420.100, SPCK421.100, SPCK 620.100, SPCK520 Compact Keypad, SPCK521 Compact Keypad","Vanderbilt International [IRL]",info@vanderbiltindustries.com,ANPI,0,05/06/2015,01/05/2017,"T 014",,,
B-958-0002,Clavier,SPCK623.100,"Siemens / Vanderbilt","Smartwares Safety & Lighting","SPCK420.100, SPCK421.100, SPCK 620.100, SPCK520 Compact Keypad, SPCK521 Compact Keypad","Vanderbilt International [IRL]",info@vanderbiltindustries.com,ANPI,a,02/05/2017,28/12/2021,"T 014",,,Prolongation
B-503-0065,Clavier,NX-1811E,INTERLOGIX,"Lobeco Fire + Security BVBA","NX-1812E, NX-1813E, NX-1814E","UTC Fire & Security EMEA",info@fs.utc.com,ANPI,0,10/08/2015,10/08/2015,"T 014",,,
B-503-0065,Clavier,NX-1811E,INTERLOGIX,"Lobeco Fire + Security BVBA","NX-1812E, NX-1813E, NX-1814E","UTC Fire & Security EMEA",info@fs.utc.com,ANPI,a,11/08/2015,10/08/2021,"T 014",,,
B-703-0015,Clavier,CA2000,ANB,"ANB Rimex",CL2000,"ANB Rimex",info@anb-rimex.be,ANPI,0,11/08/2015,28/12/2020,"T 014",,,
B-503-0067,Clavier,NXG-1820-EUR,INTERLOGIX,"Lobeco Fire + Security BVBA",,"UTC Fire & Security EMEA",info@fs.utc.com,ANPI,0,01/09/2015,21/04/2016,"T 031",,,
B-503-0067,Clavier,NXG-1820-EUR,INTERLOGIX,"Lobeco Fire + Security BVBA",,"UTC Fire & Security EMEA",info@fs.utc.com,ANPI,a,22/04/2016,19/02/2017,"T 031",,,
B-503-0067,Clavier,NXG-1820-EUR,INTERLOGIX,"Lobeco Fire + Security BVBA",,"UTC Fire & Security EMEA",info@fs.utc.com,ANPI,b,20/02/2017,31/08/2021,"T 031",,,
B-541-0019,Clavier,K641+,,"Safety Belgian Company",K641+ST,"Safety Belgian Company",sabelco@sabelco.com,ANPI,0,13/10/2015,27/10/2015,"T 031",,,
B-541-0019,Clavier,K641+,Paradox,"Safety Belgian Company",K641+ST,"Safety Belgian Company",sabelco@sabelco.com,ANPI,a,28/10/2015,24/02/2020,"T 031",,,
B-541-0019,Clavier,K641+,Paradox,"Safety Belgian Company",K641+ST,"Safety Belgian Company",sabelco@sabelco.com,ANPI,b,25/02/2020,07/10/2020,"T 031",,,
B-541-0019,Clavier,K641+,Paradox,"Safety Belgian Company",K641+ST,"Safety Belgian Company",sabelco@sabelco.com,ANPI,c,08/10/2020,12/10/2021,"T 031",,,
B-541-0019,Clavier,K641+,Paradox,"Safety Belgian Company",K641+ST,"Safety Belgian Company",sabelco@sabelco.com,ANPI,d,13/10/2021,12/10/2027,"T 031",,,Nouveau
B-703-0016,Clavier,MAD,ANB,"ANB Rimex",MAD-Alu,"ANB Rimex",info@anb-rimex.be,ANPI,0,17/12/2015,28/12/2020,"T 014",,,
B-703-0017,Clavier,Alkium-S,ANB,"ANB Rimex",Alkium-W,"ANB Rimex",info@anb-rimex.be,ANPI,0,22/12/2015,28/12/2020,"T 014",,,
B-541-0024,Clavier,K32+,,"Safety Belgian Company",K32LCD+,"Safety Belgian Company",sabelco@sabelco.com,ANPI,0,22/12/2015,21/04/2016,"T 031",,,
B-541-0024,Clavier,K32+,Paradox,"Safety Belgian Company",K32LCD+,"Safety Belgian Company",sabelco@sabelco.com,ANPI,a,22/04/2016,24/02/2020,"T 031",,,
B-541-0024,Clavier,K32+,Paradox,"Safety Belgian Company",K32LCD+,"Safety Belgian Company",sabelco@sabelco.com,ANPI,b,25/02/2020,06/09/2020,"T 031",,,
B-541-0024,Clavier,K32+,Paradox,"Safety Belgian Company",K32LCD+,"Safety Belgian Company",sabelco@sabelco.com,ANPI,c,07/09/2020,21/12/2021,"T 031",,,
B-541-0024,Clavier,K32+,Paradox,"Safety Belgian Company",K32LCD+,"Safety Belgian Company",sabelco@sabelco.com,ANPI,d,22/12/2021,21/12/2027,"T 031",,,Nouveau
C-042-1229,Clavier,"Alien/Sx [x = color]",INIM,INIM,,INIM,,"Kiwa Nederland B.V.",0,29/03/2016,21/12/2020,"T 014",,,
C-042-1229,Clavier,"Alien/Sx [x = color]",INIM,INIM,,INIM,,"Kiwa Nederland B.V.",a,22/12/2020,28/06/2021,"T 014",,,
C-042-1225,Clavier,"Alien/Gx [x = color]",INIM,INIM,,INIM,,"Kiwa Nederland B.V.",0,15/04/2016,21/12/2020,"T 014",,,
C-042-1225,Clavier,"Alien/Gx [x = color]",INIM,INIM,,INIM,,"Kiwa Nederland B.V.",a,22/12/2020,28/06/2021,"T 014",,,
C-042-1227,Clavier,Quadra/P,INIM,INIM,Quadra,INIM,,"Kiwa Nederland B.V.",0,15/04/2016,21/12/2020,"T 014",,,
C-042-1227,Clavier,Quadra/P,INIM,INIM,Quadra,INIM,,"Kiwa Nederland B.V.",a,22/12/2020,28/06/2021,"T 014",,,
B-765-0016,Clavier,FUBE50000,ABUS,"ABUS Security-Center",FUBE50001,"Eaton Electrical Products Ltd.",davidstarr@eaton.com,ANPI,0,02/06/2016,10/08/2017,"T 031",,,
B-765-0016,Clavier,FUBE50000,ABUS,"ABUS Security-Center",FUBE50001,"Eaton Electrical Products Ltd.",davidstarr@eaton.com,ANPI,a,11/08/2017,25/02/2021,"T 031",,,
B-765-0016,Clavier,FUBE50000,ABUS,"ABUS Security-Center",FUBE50001,"Eaton Electrical Products Ltd.",davidstarr@eaton.com,ANPI,b,26/02/2021,01/06/2022,"T 031",,,
D-Q2B-0003,Clavier,VEDOLCD,COMELIT,"Comelit Group Belgium",,"COMELIT GROUP",,IMQ,0,27/04/2016,01/09/2020,"T 031",,,
D-Q2B-0003,Clavier,VEDOLCD,COMELIT,"Comelit Group Belgium",,"COMELIT GROUP",,IMQ,a,02/09/2020,01/09/2026,"T 031",,,Nouveau
D-Q2B-0004,Clavier,VEDOLCDPROX,COMELIT,"Comelit Group Belgium",,"COMELIT GROUP",,IMQ,0,27/04/2016,01/09/2020,"T 031",,,
D-Q2B-0004,Clavier,VEDOLCDPROX,COMELIT,"Comelit Group Belgium",,"COMELIT GROUP",,IMQ,a,02/09/2020,01/09/2026,"T 031",,,Nouveau
D-Q2T-0001,Clavier,"ergo M","KSENIA SECURITY","Lobeco Fire + Security BVBA",,"KSENIA SECURITY S.r.l.",,IMQ,0,25/05/2016,24/05/2022,"T 031",,,
D-Q2T-0001,Clavier,"ergo M","KSENIA SECURITY","Lobeco Fire + Security BVBA",,"KSENIA SECURITY S.r.l.",,IMQ,a,31/05/2023,30/05/2029,"T 031 Ed 2 ADD1 (2018)","T 031 Ed 2 ADD1 - ADD2 (2022)",,Nouveau
D-Q2T-0002,Clavier,"ergo S","KSENIA SECURITY","Lobeco Fire + Security BVBA",,"KSENIA SECURITY S.r.l.",,IMQ,0,25/05/2016,24/05/2022,"T 031",,,
D-Q2T-0002,Clavier,"ergo S","KSENIA SECURITY","Lobeco Fire + Security BVBA",,"KSENIA SECURITY S.r.l.",,IMQ,a,31/05/2023,30/05/2029,"T 031 Ed 2 ADD1 (2018)","T 031 Ed 2 ADD1 - ADD2 (2022)",,Nouveau
B-673-0047,Clavier,RPKEL,Risco,"Risco Group Benelux","RPKELP, RPKELPH, RPKELM, RPKELPH, RPKELPM",Risco,,ANPI,0,19/07/2016,07/10/2020,"T 031",,,
B-673-0047,Clavier,RPKEL,Risco,"Risco Group Benelux","RPKELP, RPKELPH, RPKELM, RPKELPH, RPKELPM",Risco,,ANPI,a,08/10/2020,18/07/2022,"T 031",,,
B-673-0047,Clavier,RPKEL,Risco,"Risco Group Benelux","RPKELP, RPKELPH, RPKELM, RPKELPH, RPKELPM",Risco,,ANPI,b,19/07/2022,11/04/2023,"T 031",,,Nouveau
B-673-0047,Clavier,RPKEL,Risco,"Risco Group Benelux","RPKELP, RPKELPH, RPKELM, RPKELPH, RPKELPM",Risco,,ANPI,c,12/04/2023,18/07/2028,"T 031",,,Nouveau
B-767-0030,Clavier,SA-INT-KLFR-SSW,Satel,RAS,"SA-INT-KLFR-BSB, SA-INT-KLFR-WH",RAS,info@rassecurity.com,ANPI,0,28/07/2016,28/03/2022,"T 014",,,Prolongation
B-673-0053,Clavier,RW132KL1P,Risco,"Risco Group Benelux",RW132KL2P,Risco,,ANPI,0,26/08/2016,28/09/2022,"T 014A",,,Prolongation
C-035-1257,Clavier,HS2TCHP,,"Digital Security Controls, a div. of Tyco Safety Products Canada Ltd.","HS2TCHPRO, HS2TCHPROBLK","Digital Security Controls, a div. of Tyco Safety Products Canada Ltd.",,"Kiwa Nederland B.V.",0,22/07/2016,20/12/2018,"T 031",,,
C-035-1257,Clavier,HS2TCHP,DSC/Tyco,"Digital Security Controls, a div. of Tyco Safety Products Canada Ltd.","HS2TCHPRO, HS2TCHPROBLK","Digital Security Controls, a div. of Tyco Safety Products Canada Ltd.",,"Kiwa Nederland B.V.",a,21/12/2018,14/05/2019,"T 031",,,
C-035-1257,Clavier,HS2TCHP,DSC/Tyco,"Digital Security Controls, a div. of Tyco Safety Products Canada Ltd.","HS2TCHPRO, HS2TCHPROBLK","Digital Security Controls, a div. of Tyco Safety Products Canada Ltd.",,"Kiwa Nederland B.V.",b,15/05/2019,08/09/2021,"T 031",,,
C-035-1257,Clavier,HS2TCHP,DSC/Tyco,"Digital Security Controls, a div. of Tyco Safety Products Canada Ltd.","HS2TCHPRO, HS2TCHPROBLK","Digital Security Controls, a div. of Tyco Safety Products Canada Ltd.",,"Kiwa Nederland B.V.",c,09/09/2021,12/03/2023,"T 031",,,Nouveau
C-035-1257,Clavier,HS2TCHP,DSC/Tyco,"Digital Security Controls, a div. of Tyco Safety Products Canada Ltd.","HS2TCHPRO, HS2TCHPROBLK","Digital Security Controls, a div. of Tyco Safety Products Canada Ltd.",,"Kiwa Nederland B.V.",d,13/03/2023,09/09/2027,"T 031",,,Nouveau
D-Q4R-0006,Clavier,"TOUCH SCREEN BUS COD. 4020 - TOUCH SCREEN BUS COD. 4021",SILENTRON,"SILENTRON SPA",,"SILENTRON SPA",dpiga@silentron.it,IMQ,0,14/09/2016,13/09/2022,"T 031",,,
D-Q4R-0007,Clavier,"LETTORE TAG COD. 4023 - LETTORE TAG BUS COD. 4022",SILENTRON,"SILENTRON SPA",,"SILENTRON SPA",dpiga@silentron.it,IMQ,0,14/09/2016,13/09/2022,"T 031",,,
D-Q5Y-0006,Clavier,"A600Plus - A600 - A500Plus - A500 - ICE - A300Plus - A300","AVS ELECTRONICS","AVS ELECTRONICS SPA",,"AVS ELECTRONICS SPA",,IMQ,0,22/11/2016,21/11/2022,"T 031",,,
D-Q5Y-0006,Clavier,"A600Plus - A600 - A500Plus - A500 - ICE - A300Plus - A300","AVS ELECTRONICS","AVS ELECTRONICS SPA",,"AVS ELECTRONICS SPA",,IMQ,a,01/08/2023,31/07/2029,"T 031 Ed 2 ADD1 (2018)","T 031 Ed 2 ADD1 - ADD2 (2022)",,Nouveau
D-Q5Y-0007,Clavier,"RS1, RS2, RS3, RS4, RS5, RS6, RS6S, RS7, RS7B, RS7S, TOUCH-B, TOUCH-Y, TOUCH-G, TOUCH-C","AVS ELECTRONICS","AVS ELECTRONICS SPA",,"AVS ELECTRONICS SPA",,IMQ,0,22/11/2016,21/11/2022,"T 031",,,
D-Q6A-0006,Clavier,"UTS 4.3 PROXY",TECNOALARM,"Nestor Company",,"TECNOALARM SRL",tecnoalarm@tecnoalarm.com,IMQ,0,30/11/2016,29/11/2022,"T 031",,,Prolongation
D-Q6A-0006,Clavier,"UTS 4.3 PROXY",TECNOALARM,"Nestor Company",,"TECNOALARM SRL",tecnoalarm@tecnoalarm.com,IMQ,a,13/06/2023,12/06/2029,"T 031 Ed 2 ADD1 (2018)","T 031 Ed 2 ADD1 - ADD2 (2022)",,Nouveau
B-737-0021,Clavier,INT-TSG-XXX,Satel,FND,INT-TSH-XXX,FND,,ANPI,0,16/01/2017,28/12/2020,"T 014",,,
B-767-0031,Clavier,SA-INT-TSG-XXX,Satel,RAS,SA-INT-TSH-XXX,RAS,info@rassecurity.com,ANPI,0,16/01/2017,28/03/2022,"T 014",,,Prolongation
B-767-0034,Clavier,SA-VERSA-LCDM-WRL,Satel,RAS,,RAS,info@rassecurity.com,ANPI,0,17/02/2017,28/12/2020,"T 014",,,
D-Q6A-0008,Clavier,DIGITEX,TECNOALARM,"Nestor Company",,"TECNOALARM SRL",tecnoalarm@tecnoalarm.com,IMQ,0,17/03/2017,16/03/2023,"T 031",,,
D-Q6A-0008,Clavier,DIGITEX,TECNOALARM,"Nestor Company",,"TECNOALARM SRL",tecnoalarm@tecnoalarm.com,IMQ,b,13/06/2023,12/06/2029,"T 031 Ed 2 ADD1 (2018)","T 031 Ed 2 ADD1 - ADD2 (2022)","a-version non existent because of double encoding (from 0 to b)",Nouveau
B-673-0059,Clavier,RP432KPP2,,"Risco Group Benelux",RP432KP02,Risco,,ANPI,0,02/06/2017,28/08/2017,"T 031",,,
B-673-0059,Clavier,RP432KPP2,Panda,"Risco Group Benelux",RP432KP02,Risco,,ANPI,a,29/08/2017,07/10/2020,"T 031",,,
B-673-0059,Clavier,RP432KPP2,Panda,"Risco Group Benelux",RP432KP02,Risco,,ANPI,b,08/10/2020,17/05/2021,"T 031",,,
B-673-0059,Clavier,RP432KPP2,Panda,"Risco Group Benelux",RP432KP02,Risco,,ANPI,c,18/05/2021,01/06/2023,"T 031",,,Nouveau
B-673-0059,Clavier,RP432KPP2,Panda,"Risco Group Benelux",RP432KP02,Risco,,ANPI,d,02/06/2023,01/06/2029,"T 031",,,Nouveau
C-014-1334,Clavier,FPPCX-LCD/EX,PYRONIX,"Pyronix Ltd.",,"Pyronix Ltd.",,"Kiwa Nederland B.V.",0,04/07/2017,28/12/2020,"T 014",,,
D-Q1F-0008,Clavier,"ABSOLUTA M-TOUCH","BENTEL SECURITY","Alarm International Systems [AIS]",,"BENTEL SECURITY SRL",,IMQ,0,15/09/2017,05/04/2021,"T 031",,,
D-Q1F-0008,Clavier,"ABSOLUTA M-TOUCH","BENTEL SECURITY","Alarm International Systems [AIS]",,"BENTEL SECURITY SRL",,IMQ,a,06/04/2021,01/12/2026,"T 031",,,Nouveau
D-Q1F-0010,Clavier,ARC20,"BENTEL SECURITY","Alarm International Systems [AIS]",,"BENTEL SECURITY SRL",,IMQ,0,15/09/2017,14/09/2023,"T 031",,,
D-Q1F-0013,Clavier,PROXI2,"BENTEL SECURITY","Alarm International Systems [AIS]",,"BENTEL SECURITY SRL",,IMQ,0,15/09/2017,14/09/2023,"T 031",,,
D-Q1F-0014,Clavier,"ABSOLUTA T-WHITE","BENTEL SECURITY","Alarm International Systems [AIS]",,"BENTEL SECURITY SRL",,IMQ,0,15/09/2017,06/07/2022,"T 031",,,
D-Q1F-0014,Clavier,"ABSOLUTA T-WHITE","BENTEL SECURITY","Alarm International Systems [AIS]",,"BENTEL SECURITY SRL",,IMQ,a,07/07/2022,06/07/2028,"T 031",,,Nouveau
D-Q2T-0004,Clavier,"ERGO -KSI2100000.300","KSENIA SECURITY","Ksenia Security SRL",,"KSENIA SECURITY S.r.l.",,IMQ,0,18/10/2017,17/10/2023,"T 031",,,
D-Q2T-0005,Clavier,"VOLO - KSI2200000.300","KSENIA SECURITY","Ksenia Security SRL",,"KSENIA SECURITY S.r.l.",,IMQ,0,18/10/2017,17/10/2023,"T 031",,,
C-027-1362,Clavier,JA-110E,Jablotron,"Jablotron Alarms a.s.",,"Jablotron Alarms a.s.",,"Kiwa Nederland B.V.",0,21/11/2017,16/05/2022,"T 031",,,
C-027-1362,Clavier,JA-110E,Jablotron,"Jablotron Alarms a.s.",,"Jablotron Alarms a.s.",,"Kiwa Nederland B.V.",a,17/05/2022,18/03/2023,"T 031",,,Nouveau
C-027-1362,Clavier,JA-110E,Jablotron,"Jablotron Alarms a.s.",,"Jablotron Alarms a.s.",,"Kiwa Nederland B.V.",b,19/03/2023,17/05/2028,"T 031",,,Nouveau
D-R7F-0002,Clavier,KEYFOB-WE,PYRONIX,"PYRONIX LIMITED",,"PYRONIX LIMITED",,IMQ,0,24/10/2017,23/10/2023,"T 031",,,
D-R7F-0003,Clavier,LEDRKP/WHITE-WE,PYRONIX,"PYRONIX LIMITED",,"PYRONIX LIMITED",,IMQ,0,24/10/2017,23/10/2023,"T 031",,,
D-R7F-0004,Clavier,PCX-LCDP-W,PYRONIX,"PYRONIX LIMITED",,"PYRONIX LIMITED",,IMQ,0,24/10/2017,23/10/2023,"T 031",,,
C-027-1350,Clavier,JA-10E,Jablotron,"Jablotron Alarms a.s.","10E, KEYPAD2","Jablotron Alarms a.s.",,"Kiwa Nederland B.V.",0,20/02/2018,16/05/2022,"T 031",,,
C-027-1350,Clavier,JA-10E,Jablotron,"Jablotron Alarms a.s.","10E, KEYPAD2","Jablotron Alarms a.s.",,"Kiwa Nederland B.V.",a,17/05/2022,18/03/2023,"T 031",,,Nouveau
C-027-1350,Clavier,JA-10E,Jablotron,"Jablotron Alarms a.s.","10E, KEYPAD2","Jablotron Alarms a.s.",,"Kiwa Nederland B.V.",b,19/03/2023,17/05/2028,"T 031",,,Nouveau
B-541-2002,Clavier,"DMP 7060 INT",DMP,"Safety Belgian Company","DMP 7063 INT, DMP 7073 INT, DMP 7872 INT, DMP 7873 INT","Safety Belgian Company",sabelco@sabelco.com,ANPI,0,12/11/2018,14/09/2021,"T 033",,,
B-541-2002,Clavier,"DMP 7060 INT",DMP,"Safety Belgian Company","DMP 7063 INT, DMP 7073 INT, DMP 7872 INT, DMP 7873 INT","Safety Belgian Company",sabelco@sabelco.com,ANPI,a,15/09/2021,21/03/2022,"T 033",,"New EN Certificate",Nouveau
B-541-2002,Clavier,"DMP 7060 INT",DMP,"Safety Belgian Company","DMP 7063 INT, DMP 7073 INT, DMP 7872 INT, DMP 7873 INT","Safety Belgian Company",sabelco@sabelco.com,ANPI,b,22/03/2022,21/03/2028,"T 033 Ed 1 (2017)",,"update EN certificate",Nouveau
C-026-1397,Clavier,DBAA1000,Premier,"Texecom Ltd.","DBBA1000, DBCA1000, DBDA1000, DBDA1010, DBDA3000, DBDA4000","Texecom Ltd.",,"Kiwa Nederland B.V.",0,04/12/2018,18/10/2021,"T 031",,,
C-026-1397,Clavier,DBAA1000,Premier,"Texecom Ltd.","DBBA1000, DBCA1000, DBDA1000, DBDA1010, DBDA3000, DBDA4000","Texecom Ltd.",,"Kiwa Nederland B.V.",a,19/10/2021,12/03/2023,"T 031",,,Nouveau
C-026-1397,Clavier,DBAA1000,Premier,"Texecom Ltd.","DBBA1000, DBCA1000, DBDA1000, DBDA1010, DBDA3000, DBDA4000","Texecom Ltd.",,"Kiwa Nederland B.V.",b,13/03/2023,08/11/2023,"T 031",,,Nouveau
C-026-1397,Clavier,DBAA1000,Premier,"Texecom Ltd.","DBBA1000, DBCA1000, DBDA1000, DBDA1010, DBDA3000, DBDA4000","Texecom Ltd.",,"Kiwa Nederland B.V.",c,09/11/2023,09/11/2029,"T 031 Ed 2 ADD1 - ADD2 (2022)",,,Nouveau
C-035-1418,Clavier,HS2LCDP,DSC/Tyco,"Digital Security Controls, a div. of Tyco Safety Products Canada Ltd.","HS2LCD, HS2LCDPRO","Digital Security Controls, a div. of Tyco Safety Products Canada Ltd.",,"Kiwa Nederland B.V.",0,21/12/2018,14/05/2019,"T 031",,,
C-035-1418,Clavier,HS2LCDP,DSC/Tyco,"Digital Security Controls, a div. of Tyco Safety Products Canada Ltd.","HS2LCD, HS2LCDPRO","Digital Security Controls, a div. of Tyco Safety Products Canada Ltd.",,"Kiwa Nederland B.V.",a,15/05/2019,01/09/2021,"T 031",,,
C-035-1418,Clavier,HS2LCDP,DSC/Tyco,"Digital Security Controls, a div. of Tyco Safety Products Canada Ltd.","HS2LCD, HS2LCDPRO","Digital Security Controls, a div. of Tyco Safety Products Canada Ltd.",,"Kiwa Nederland B.V.",b,02/09/2021,12/03/2023,"T 031",,,Nouveau
C-035-1418,Clavier,HS2LCDP,DSC/Tyco,"Digital Security Controls, a div. of Tyco Safety Products Canada Ltd.","HS2LCD, HS2LCDPRO","Digital Security Controls, a div. of Tyco Safety Products Canada Ltd.",,"Kiwa Nederland B.V.",c,13/03/2023,25/05/2024,"T 031",,,Nouveau
D-Q2T-0016,Clavier,VOLO-IN,"KSENIA SECURITY","Lobeco Fire + Security B.V.",,"KSENIA SECURITY S.r.l.",,IMQ,0,27/11/2018,26/11/2024,"T 031",,,
C-035-1427,Clavier,HS2LCDWFPV8,DSC/Tyco,"Digital Security Controls, a div. of Tyco Safety Products Canada Ltd.","HS2LCDWFP8, HS2LCDWF8, HS2LCDWFVPRO8, HS2LCDWFPRO8","Digital Security Controls, a div. of Tyco Safety Products Canada Ltd.",,"Kiwa Nederland B.V.",0,08/05/2019,23/02/2021,"T 031",,,
C-035-1427,Clavier,HS2LCDWFPV8,DSC/Tyco,"Digital Security Controls, a div. of Tyco Safety Products Canada Ltd.","HS2LCDWFP8, HS2LCDWF8, HS2LCDWFVPRO8, HS2LCDWFPRO8","Digital Security Controls, a div. of Tyco Safety Products Canada Ltd.",,"Kiwa Nederland B.V.",a,02/09/2021,12/03/2023,"T 031",,,Nouveau
C-035-1427,Clavier,HS2LCDWFPV8,DSC/Tyco,"Digital Security Controls, a div. of Tyco Safety Products Canada Ltd.","HS2LCDWFP8, HS2LCDWF8, HS2LCDWFVPRO8, HS2LCDWFPRO8","Digital Security Controls, a div. of Tyco Safety Products Canada Ltd.",,"Kiwa Nederland B.V.",b,13/03/2023,25/05/2024,"T 031",,,Nouveau
D-R7F-0008,Clavier,LEDP/R-WE,PYRONIX,"PYRONIX LIMITED",,"PYRONIX LIMITED",,IMQ,0,27/11/2019,26/11/2025,"T 031",,,
C-027-1440,Clavier,JA-114E,Jablotron,"Jablotron Alarms a.s.",,"Jablotron Alarms a.s.",,"Kiwa Nederland B.V.",0,24/09/2019,12/03/2023,"T 031",,,
C-027-1440,Clavier,JA-114E,Jablotron,"Jablotron Alarms a.s.",,"Jablotron Alarms a.s.",,"Kiwa Nederland B.V.",a,13/03/2023,23/09/2025,"T 031",,,Nouveau
B-673-1010,Clavier,RP432KPT,Risco,"RISCO Group Benelux",RP432KPTZ,Risco,,ANPI,0,15/07/2021,06/12/2021,"T 033",,,
B-673-1010,Clavier,RP432KPT,Risco,"RISCO Group Benelux",RP432KPTZ,Risco,,ANPI,a,07/12/2021,08/07/2024,"T 033",,"Add a variant to the product: RP432KPTZ",Nouveau
C-035-1560,Clavier,HS2LED,DSC/Tyco,"Digital Security Controls, a div. of Tyco Safety Products Canada Ltd.",,"Digital Security Controls, a div. of Tyco Safety Products Canada Ltd.",,"Kiwa Nederland B.V.",0,05/08/2021,12/03/2023,"T 031",,,
C-035-1560,Clavier,HS2LED,DSC/Tyco,"Digital Security Controls, a div. of Tyco Safety Products Canada Ltd.",,"Digital Security Controls, a div. of Tyco Safety Products Canada Ltd.",,"Kiwa Nederland B.V.",a,13/03/2023,29/12/2026,"T 031",,,Nouveau
C-016-1609,Clavier,KEY-KPZ01,Eaton,"Eaton Electrical Products Ltd.","KEY-KP01, KEY-K01","Eaton Electrical Products Ltd.",davidstarr@eaton.com,"Kiwa Nederland B.V.",0,03/11/2021,12/03/2023,"T 031",,,
C-016-1609,Clavier,KEY-KPZ01,Eaton,"Eaton Electrical Products Ltd.","KEY-KP01, KEY-K01","Eaton Electrical Products Ltd.",davidstarr@eaton.com,"Kiwa Nederland B.V.",a,13/03/2023,03/11/2027,"T 031",,,Nouveau
B-767-1013,Clavier,SA-INT-KLCD,Satel,RAS,SA-INT-KLCDR,RAS,info@rassecurity.com,ANPI,0,03/12/2021,04/04/2022,"T 033",,,
D-Q2B-0016,Clavier,"VEDOKP - VEDOKPR",COMELIT,"Comelit Group Belgium",,"COMELIT GROUP",,IMQ,0,03/12/2021,02/12/2027,"T 031",,,
D-R5S-0012,Clavier,"nBy/KB - nBy/KN","INIM ELECTRONICS","INIM ELECTRONICS SRL",,"INIM ELECTRONICS SRL",,IMQ,0,19/11/2021,18/12/2027,"T 031",,,
D-R5S-0013,Clavier,"Aria/HGB - Aria/HGN","INIM ELECTRONICS","INIM ELECTRONICS SRL",,"INIM ELECTRONICS SRL",,IMQ,0,19/11/2021,18/11/2027,"T 031",,,
B-007-2002,Clavier,"Vanderbilt SPCK623.100",Vanderbilt,SmartSD,"Vanderbilt SPCK620.100, Vanderbilt SPCK521.100, Vanderbilt SPCK520.100, Vanderbilt SPCK420.100, Vanderbilt SPCK421.100",VANDERBILT,,ANPI,0,31/01/2022,30/11/2022,"T 033",,,
B-007-2002,Clavier,"Vanderbilt SPCK623.100",Vanderbilt,SmartSD,"Vanderbilt SPCK620.100, Vanderbilt SPCK521.100, Vanderbilt SPCK520.100, Vanderbilt SPCK420.100, Vanderbilt SPCK421.100",VANDERBILT,,ANPI,a,01/12/2022,30/11/2023,"T 033",,"update des certificats EN (VDS)",Nouveau
B-007-2002,Clavier,"Vanderbilt SPCK623.100",Vanderbilt,SmartSD,"Vanderbilt SPCK620.100, Vanderbilt SPCK521.100, Vanderbilt SPCK520.100, Vanderbilt SPCK420.100, Vanderbilt SPCK421.100",VANDERBILT,,ANPI,b,01/12/2023,28/06/2024,"T 033 Ed 3 (2020)",,"Update EN-certificate (VdS)",Nouveau
B-909-1007,Clavier,"Daitem SH640AX",Daitem,"Hager Modulec","Daitem SH630AX","Hager Security",,ANPI,0,07/02/2022,05/10/2024,"T 033",,,
B-503-0086,Clavier,ATS1136,Aritech,"Carrier Fire & Security EMEA bvba",ATS1136S44,"Carrier Fire & Security EMEA bvba",,ANPI,0,26/02/2021,19/02/2022,"T 031",,,
B-503-0086,Clavier,ATS1136,Aritech,"Carrier Fire & Security EMEA bvba",ATS1136S44,"Carrier Fire & Security EMEA bvba",,ANPI,a,20/02/2022,20/02/2022,"T 031",,,Nouveau
B-503-0086,Clavier,ATS1136,Aritech,"Carrier Fire & Security EMEA bvba",ATS1136S44,"Carrier Fire & Security EMEA bvba",,ANPI,b,21/02/2022,25/02/2027,"T 031",,,Nouveau
D-Q42-0008,Clavier,CT2000,ANB-RIMEX,"ANB-RIMEX S.A.",,"AnB-Rimex s.a.",info@anb-rimex.be,IMQ,0,30/06/2021,29/06/2027,"T 031",,,
D-Q42-0009,Clavier,CL2000,ANB-RIMEX,"ANB-RIMEX S.A.",,"AnB-Rimex s.a.",info@anb-rimex.be,IMQ,0,30/06/2021,30/06/2027,"T 031",,,
D-Q42-0011,Clavier,MAD,ANB-RIMEX,"ANB-RIMEX S.A.",,"AnB-Rimex s.a.",info@anb-rimex.be,IMQ,0,30/06/2021,29/06/2027,"T 031",,,